Reaction Details
TargetCarbonic anhydrase 2
LigandBDBM50428435
Substrate/Competitorn/a
Meas. Tech.ChEMBL_942130 (CHEMBL2341286)
Ki 78900±n/a nM
Citation Davis, RAVullo, DMaresca, ASupuran, CTPoulsen, SA Natural product coumarins that inhibit human carbonic anhydrases. Bioorg Med Chem21:1539-43 (2013) 
 
Carbonic anhydrase 2
Name:Carbonic anhydrase 2
Type:Enzyme
Mol. Mass.:29250.71
Organism:Homo sapiens (Human)
Description:P00918
Residue:260
BDBM50428435
NameBDBM50428435
Synonyms:CHEMBL2334353
TypeSmall organic molecule
Emp. Form.C14H14O4
Mol. Mass.246.2586
SMILESC\C(CO)=C/Cc1cc2ccc(=O)oc2cc1O