Reaction Details
TargetCarbonic anhydrase 2
LigandBDBM50428436
Substrate/Competitorn/a
Meas. Tech.ChEMBL_942130 (CHEMBL2341286)
Ki 63400±n/a nM
Citation Davis, RAVullo, DMaresca, ASupuran, CTPoulsen, SA Natural product coumarins that inhibit human carbonic anhydrases. Bioorg Med Chem21:1539-43 (2013) 
 
Carbonic anhydrase 2
Name:Carbonic anhydrase 2
Type:Enzyme
Mol. Mass.:29250.71
Organism:Homo sapiens (Human)
Description:P00918
Residue:260
BDBM50428436
NameBDBM50428436
Synonyms:CHEMBL1995684
TypeSmall organic molecule
Emp. Form.C19H20O5
Mol. Mass.328.3591
SMILESCC(CCOc1ccc2ccc(=O)oc2c1)C1=CC(=O)C(C)(C)O1