Reaction Details
TargetCarbonic anhydrase 12
LigandBDBM50428439
Substrate/Competitorn/a
Meas. Tech.ChEMBL_942127 (CHEMBL2341283)
Ki 18200±n/a nM
Citation Davis, RAVullo, DMaresca, ASupuran, CTPoulsen, SA Natural product coumarins that inhibit human carbonic anhydrases. Bioorg Med Chem21:1539-43 (2013) 
 
Carbonic anhydrase 12
Name:Carbonic anhydrase 12
Type:Enzyme
Mol. Mass.:39456.00
Organism:Homo sapiens (Human)
Description:Catalytic domain of human cloned isozyme was used in the assay
Residue:354
BDBM50428439
NameBDBM50428439
Synonyms:6,7,8,-Trimethoxycoumarin CHEMBL253551
TypeSmall organic molecule
Emp. Form.C12H12O5
Mol. Mass.236.2207
SMILESCOc1cc2ccc(=O)oc2c(OC)c1OC