Reaction Details
TargetCarbonic anhydrase 13
LigandBDBM50206215
Substrate/Competitorn/a
Meas. Tech.ChEMBL_942126 (CHEMBL2341282)
Ki 9730±n/a nM
Citation Davis, RAVullo, DMaresca, ASupuran, CTPoulsen, SA Natural product coumarins that inhibit human carbonic anhydrases. Bioorg Med Chem21:1539-43 (2013) 
 
Carbonic anhydrase 13
Name:Carbonic anhydrase 13
Type:Enzyme
Mol. Mass.:29445.78
Organism:Homo sapiens (Human)
Description:Q8N1Q1
Residue:262
BDBM50206215
NameBDBM50206215
Synonyms:7,8-Dihydroxy-6-methoxy-chromen-2-one CHEMBL54909 | FRAXETIN
TypeSmall organic molecule
Emp. Form.C10H8O5
Mol. Mass.208.1675
SMILESCOc1cc2ccc(=O)oc2c(O)c1O