Reaction Details
TargetCarbonic anhydrase 12
LigandBDBM50428438
Substrate/Competitorn/a
Meas. Tech.ChEMBL_942127 (CHEMBL2341283)
Ki 9120±n/a nM
Citation Davis, RAVullo, DMaresca, ASupuran, CTPoulsen, SA Natural product coumarins that inhibit human carbonic anhydrases. Bioorg Med Chem21:1539-43 (2013) 
 
Carbonic anhydrase 12
Name:Carbonic anhydrase 12
Type:Enzyme
Mol. Mass.:39456.00
Organism:Homo sapiens (Human)
Description:Catalytic domain of human cloned isozyme was used in the assay
Residue:354
BDBM50428438
NameBDBM50428438
Synonyms:CHEMBL2331585
TypeSmall organic molecule
Emp. Form.C10H8O4
Mol. Mass.192.1681
SMILESCOc1c(O)ccc2ccc(=O)oc12