Reaction Details
TargetCarbonic anhydrase 12
LigandBDBM50428424
Substrate/Competitorn/a
Meas. Tech.ChEMBL_942127 (CHEMBL2341283)
Ki 8510±n/a nM
Citation Davis, RAVullo, DMaresca, ASupuran, CTPoulsen, SA Natural product coumarins that inhibit human carbonic anhydrases. Bioorg Med Chem21:1539-43 (2013) 
 
Carbonic anhydrase 12
Name:Carbonic anhydrase 12
Type:Enzyme
Mol. Mass.:39456.00
Organism:Homo sapiens (Human)
Description:Catalytic domain of human cloned isozyme was used in the assay
Residue:354
BDBM50428424
NameBDBM50428424
Synonyms:CHEMBL2334356
TypeSmall organic molecule
Emp. Form.C30H25NO9
Mol. Mass.543.5208
SMILESCOc1cc(ccc1O)-c1c2c(n3ccc4c(OC)c(OC)c(OC)cc4c13)c(=O)oc1cc(O)c(OC)cc21