Reaction Details
TargetCarbonic anhydrase 7
LigandBDBM50421583
Substrate/Competitorn/a
Meas. Tech.ChEMBL_942129 (CHEMBL2341285)
Ki 7820±n/a nM
Citation Davis, RAVullo, DMaresca, ASupuran, CTPoulsen, SA Natural product coumarins that inhibit human carbonic anhydrases. Bioorg Med Chem21:1539-43 (2013) 
 
Carbonic anhydrase 7
Name:Carbonic anhydrase 7
Type:Enzyme
Mol. Mass.:29664.11
Organism:Homo sapiens (Human)
Description:Human cloned isozyme.
Residue:264
BDBM50421583
NameBDBM50421583
Synonyms:GEIPARVARIN
TypeSmall organic molecule
Emp. Form.C19H18O5
Mol. Mass.326.3432
SMILESC\C(=C/COc1ccc2ccc(=O)oc2c1)C1=CC(=O)C(C)(C)O1