Reaction Details
TargetCarbonic anhydrase 1
LigandBDBM50428433
Substrate/Competitorn/a
Meas. Tech.ChEMBL_942131 (CHEMBL2341287)
Ki 7810±n/a nM
Citation Davis, RAVullo, DMaresca, ASupuran, CTPoulsen, SA Natural product coumarins that inhibit human carbonic anhydrases. Bioorg Med Chem21:1539-43 (2013) 
 
Carbonic anhydrase 1
Name:Carbonic anhydrase 1
Type:Enzyme
Mol. Mass.:28873.37
Organism:Homo sapiens (Human)
Description:P00915
Residue:261
BDBM50428433
NameBDBM50428433
Synonyms:CHEMBL2003049
TypeSmall organic molecule
Emp. Form.C19H22O5
Mol. Mass.330.375
SMILESC\C(CCC(=O)C(C)(C)O)=C/COc1ccc2ccc(=O)oc2c1