Reaction Details
TargetCarbonic anhydrase 1
LigandBDBM50428432
Substrate/Competitorn/a
Meas. Tech.ChEMBL_942131 (CHEMBL2341287)
Ki 7710±n/a nM
Citation Davis, RAVullo, DMaresca, ASupuran, CTPoulsen, SA Natural product coumarins that inhibit human carbonic anhydrases. Bioorg Med Chem21:1539-43 (2013) 
 
Carbonic anhydrase 1
Name:Carbonic anhydrase 1
Type:Enzyme
Mol. Mass.:28873.37
Organism:Homo sapiens (Human)
Description:P00915
Residue:261
BDBM50428432
NameBDBM50428432
Synonyms:XANTHOXYLETIN
TypeSmall organic molecule
Emp. Form.C15H14O4
Mol. Mass.258.2693
SMILESCOc1c2C=CC(C)(C)Oc2cc2oc(=O)ccc12