Reaction Details
TargetCarbonic anhydrase 1
LigandBDBM50428435
Substrate/Competitorn/a
Meas. Tech.ChEMBL_942131 (CHEMBL2341287)
Ki 7520±n/a nM
Citation Davis, RAVullo, DMaresca, ASupuran, CTPoulsen, SA Natural product coumarins that inhibit human carbonic anhydrases. Bioorg Med Chem21:1539-43 (2013) 
 
Carbonic anhydrase 1
Name:Carbonic anhydrase 1
Type:Enzyme
Mol. Mass.:28873.37
Organism:Homo sapiens (Human)
Description:P00915
Residue:261
BDBM50428435
NameBDBM50428435
Synonyms:CHEMBL2334353
TypeSmall organic molecule
Emp. Form.C14H14O4
Mol. Mass.246.2586
SMILESC\C(CO)=C/Cc1cc2ccc(=O)oc2cc1O