Reaction Details
TargetCarbonic anhydrase 9
LigandBDBM50206008
Substrate/Competitorn/a
Meas. Tech.ChEMBL_942128 (CHEMBL2341284)
Ki 7370±n/a nM
Citation Davis, RAVullo, DMaresca, ASupuran, CTPoulsen, SA Natural product coumarins that inhibit human carbonic anhydrases. Bioorg Med Chem21:1539-43 (2013) 
 
Carbonic anhydrase 9
Name:Carbonic anhydrase 9
Type:Enzyme
Mol. Mass.:49669.03
Organism:Homo sapiens (Human)
Description:Catalytic domain of human cloned isozyme was used in the assay
Residue:459
BDBM50206008
NameBDBM50206008
Synonyms:6-hydroxy-7-methoxy-2H-chromen-2-one isoscopoletin
TypeSmall organic molecule
Emp. Form.C10H8O4
Mol. Mass.192.1681
SMILESCOc1cc2oc(=O)ccc2cc1O