Reaction Details
TargetCarbonic anhydrase 1
LigandBDBM50428428
Substrate/Competitorn/a
Meas. Tech.ChEMBL_942131 (CHEMBL2341287)
Ki 5930±n/a nM
Citation Davis, RAVullo, DMaresca, ASupuran, CTPoulsen, SA Natural product coumarins that inhibit human carbonic anhydrases. Bioorg Med Chem21:1539-43 (2013) 
 
Carbonic anhydrase 1
Name:Carbonic anhydrase 1
Type:Enzyme
Mol. Mass.:28873.37
Organism:Homo sapiens (Human)
Description:P00915
Residue:261
BDBM50428428
NameBDBM50428428
Synonyms:CHEMBL225024 | Scopolin
TypeSmall organic molecule
Emp. Form.C16H18O9
Mol. Mass.354.3087
SMILESCOc1cc2ccc(=O)oc2cc1O[C@@H]1O[C@H](CO)[C@@H](O)[C@H](O)[C@H]1O