Reaction Details
TargetCarbonic anhydrase 9
LigandBDBM50428421
Substrate/Competitorn/a
Meas. Tech.ChEMBL_942128 (CHEMBL2341284)
Ki 860±n/a nM
Citation Davis, RAVullo, DMaresca, ASupuran, CTPoulsen, SA Natural product coumarins that inhibit human carbonic anhydrases. Bioorg Med Chem21:1539-43 (2013) 
 
Carbonic anhydrase 9
Name:Carbonic anhydrase 9
Type:Enzyme
Mol. Mass.:49669.03
Organism:Homo sapiens (Human)
Description:Catalytic domain of human cloned isozyme was used in the assay
Residue:459
BDBM50428421
NameBDBM50428421
Synonyms:CHEMBL2334350
TypeSmall organic molecule
Emp. Form.C16H16O5
Mol. Mass.288.2952
SMILESCOc1c2OC(C)(C)C=Cc2c(OC)c2ccc(=O)oc12