Reaction Details
TargetCarbonic anhydrase 9
LigandBDBM50421583
Substrate/Competitorn/a
Meas. Tech.ChEMBL_942128 (CHEMBL2341284)
Ki 600±n/a nM
Citation Davis, RAVullo, DMaresca, ASupuran, CTPoulsen, SA Natural product coumarins that inhibit human carbonic anhydrases. Bioorg Med Chem21:1539-43 (2013) 
 
Carbonic anhydrase 9
Name:Carbonic anhydrase 9
Type:Enzyme
Mol. Mass.:49669.03
Organism:Homo sapiens (Human)
Description:Catalytic domain of human cloned isozyme was used in the assay
Residue:459
BDBM50421583
NameBDBM50421583
Synonyms:GEIPARVARIN
TypeSmall organic molecule
Emp. Form.C19H18O5
Mol. Mass.326.3432
SMILESC\C(=C/COc1ccc2ccc(=O)oc2c1)C1=CC(=O)C(C)(C)O1