Reaction Details
TargetCarbonic anhydrase 9
LigandBDBM50428429
Substrate/Competitorn/a
Meas. Tech.ChEMBL_942128 (CHEMBL2341284)
Ki 370±n/a nM
Citation Davis, RAVullo, DMaresca, ASupuran, CTPoulsen, SA Natural product coumarins that inhibit human carbonic anhydrases. Bioorg Med Chem21:1539-43 (2013) 
 
Carbonic anhydrase 9
Name:Carbonic anhydrase 9
Type:Enzyme
Mol. Mass.:49669.03
Organism:Homo sapiens (Human)
Description:Catalytic domain of human cloned isozyme was used in the assay
Residue:459
BDBM50428429
NameBDBM50428429
Synonyms:FRAXINE
TypeSmall organic molecule
Emp. Form.C16H18O10
Mol. Mass.370.3081
SMILESCOc1cc2ccc(=O)oc2c(O[C@@H]2O[C@H](CO)[C@@H](O)[C@H](O)[C@H]2O)c1O