Reaction Details
TargetLD26647p
LigandBDBM50382724
Substrate/Competitorn/a
Meas. Tech.ChEMBL_942137 (CHEMBL2341293)
Ki 14±n/a nM
Citation Syrjänen, LTolvanen, MEHilvo, MVullo, DCarta, FSupuran, CTParkkila, S Characterization, bioinformatic analysis and dithiocarbamate inhibition studies of two newa-carbonic anhydrases, CAH1 and CAH2, from the fruit fly Drosophila melanogaster. Bioorg Med Chem21:1516-21 (2013) 
 
LD26647p
Name:LD26647p
Type:PROTEIN
Mol. Mass.:37674.24
Organism:Drosophila melanogaster
Description:ChEMBL_942137
Residue:335
BDBM50382724
NameBDBM50382724
Synonyms:CHEMBL2023730
TypeSmall organic molecule
Emp. Form.C6H7NO2S2
Mol. Mass.189.256
SMILES[O-]C(=O)[C@@H]1CCCN1C([S-])=S