Reaction Details
TargetLD26647p
LigandBDBM50382717
Substrate/Competitorn/a
Meas. Tech.ChEMBL_942137 (CHEMBL2341293)
Ki 3.8±n/a nM
Citation Syrjänen, LTolvanen, MEHilvo, MVullo, DCarta, FSupuran, CTParkkila, S Characterization, bioinformatic analysis and dithiocarbamate inhibition studies of two newa-carbonic anhydrases, CAH1 and CAH2, from the fruit fly Drosophila melanogaster. Bioorg Med Chem21:1516-21 (2013) 
 
LD26647p
Name:LD26647p
Type:PROTEIN
Mol. Mass.:37674.24
Organism:Drosophila melanogaster
Description:ChEMBL_942137
Residue:335
BDBM50382717
NameBDBM50382717
Synonyms:CHEMBL2023722
TypeSmall organic molecule
Emp. Form.C13H26NS2
Mol. Mass.260.483
SMILESCCCCCCN(CCCCCC)C([S-])=S