Reaction Details
TargetLD26647p
LigandBDBM50382704
Substrate/Competitorn/a
Meas. Tech.ChEMBL_942137 (CHEMBL2341293)
Ki 0.900000±n/a nM
Citation Syrjänen, LTolvanen, MEHilvo, MVullo, DCarta, FSupuran, CTParkkila, S Characterization, bioinformatic analysis and dithiocarbamate inhibition studies of two newa-carbonic anhydrases, CAH1 and CAH2, from the fruit fly Drosophila melanogaster. Bioorg Med Chem21:1516-21 (2013) 
 
LD26647p
Name:LD26647p
Type:PROTEIN
Mol. Mass.:37674.24
Organism:Drosophila melanogaster
Description:ChEMBL_942137
Residue:335
BDBM50382704
NameBDBM50382704
Synonyms:CHEMBL2023165
TypeSmall organic molecule
Emp. Form.C5H10NS2
Mol. Mass.148.27
SMILESCCC(C)NC([S-])=S