Reaction Details
TargetCarbonic anhydrase
LigandBDBM50382724
Substrate/Competitorn/a
Meas. Tech.ChEMBL_942138 (CHEMBL2341294)
Ki 1.4±n/a nM
Citation Syrjänen, LTolvanen, MEHilvo, MVullo, DCarta, FSupuran, CTParkkila, S Characterization, bioinformatic analysis and dithiocarbamate inhibition studies of two newa-carbonic anhydrases, CAH1 and CAH2, from the fruit fly Drosophila melanogaster. Bioorg Med Chem21:1516-21 (2013) 
 
Carbonic anhydrase
Name:Carbonic anhydrase
Type:PROTEIN
Mol. Mass.:29950.70
Organism:Drosophila melanogaster
Description:ChEMBL_942138
Residue:270
BDBM50382724
NameBDBM50382724
Synonyms:CHEMBL2023730
TypeSmall organic molecule
Emp. Form.C6H7NO2S2
Mol. Mass.189.256
SMILES[O-]C(=O)[C@@H]1CCCN1C([S-])=S