Reaction Details
TargetCarbonic anhydrase
LigandBDBM50382710
Substrate/Competitorn/a
Meas. Tech.ChEMBL_942138 (CHEMBL2341294)
Ki 123±n/a nM
Citation Syrjänen, LTolvanen, MEHilvo, MVullo, DCarta, FSupuran, CTParkkila, S Characterization, bioinformatic analysis and dithiocarbamate inhibition studies of two newa-carbonic anhydrases, CAH1 and CAH2, from the fruit fly Drosophila melanogaster. Bioorg Med Chem21:1516-21 (2013) 
 
Carbonic anhydrase
Name:Carbonic anhydrase
Type:PROTEIN
Mol. Mass.:29950.70
Organism:Drosophila melanogaster
Description:ChEMBL_942138
Residue:270
BDBM50382710
NameBDBM50382710
Synonyms:CHEMBL2023172
TypeSmall organic molecule
Emp. Form.C3H3NO2S2
Mol. Mass.149.193
SMILES[O-]C(=O)CNC([S-])=S