Reaction Details
TargetCarbonic anhydrase
LigandBDBM50382706
Substrate/Competitorn/a
Meas. Tech.ChEMBL_942138 (CHEMBL2341294)
Ki 0.800000±n/a nM
Citation Syrjänen, LTolvanen, MEHilvo, MVullo, DCarta, FSupuran, CTParkkila, S Characterization, bioinformatic analysis and dithiocarbamate inhibition studies of two newa-carbonic anhydrases, CAH1 and CAH2, from the fruit fly Drosophila melanogaster. Bioorg Med Chem21:1516-21 (2013) 
 
Carbonic anhydrase
Name:Carbonic anhydrase
Type:PROTEIN
Mol. Mass.:29950.70
Organism:Drosophila melanogaster
Description:ChEMBL_942138
Residue:270
BDBM50382706
NameBDBM50382706
Synonyms:Benzyldithiocarbamate sodium salt (I) | CHEMBL2023168
TypeSmall organic molecule
Emp. Form.C8H8NS2
Mol. Mass.182.286
SMILES[S-]C(=S)NCc1ccccc1