Reaction Details
TargetCarbonic anhydrase
LigandBDBM50428444
Substrate/Competitorn/a
Meas. Tech.ChEMBL_942138 (CHEMBL2341294)
Ki 134±n/a nM
Citation Syrjänen, LTolvanen, MEHilvo, MVullo, DCarta, FSupuran, CTParkkila, S Characterization, bioinformatic analysis and dithiocarbamate inhibition studies of two newa-carbonic anhydrases, CAH1 and CAH2, from the fruit fly Drosophila melanogaster. Bioorg Med Chem21:1516-21 (2013) 
 
Carbonic anhydrase
Name:Carbonic anhydrase
Type:PROTEIN
Mol. Mass.:29950.70
Organism:Drosophila melanogaster
Description:ChEMBL_942138
Residue:270
BDBM50428444
NameBDBM50428444
Synonyms:CHEMBL2334359
TypeSmall organic molecule
Emp. Form.C8H13N4S6
Mol. Mass.357.607
SMILES[S-]C(=S)NCCN(CCNC([S-])=S)CNC([S-])=S