Reaction Details
TargetCarbonic anhydrase
LigandBDBM50382705
Substrate/Competitorn/a
Meas. Tech.ChEMBL_942138 (CHEMBL2341294)
Ki 12±n/a nM
Citation Syrjänen, LTolvanen, MEHilvo, MVullo, DCarta, FSupuran, CTParkkila, S Characterization, bioinformatic analysis and dithiocarbamate inhibition studies of two newa-carbonic anhydrases, CAH1 and CAH2, from the fruit fly Drosophila melanogaster. Bioorg Med Chem21:1516-21 (2013) 
 
Carbonic anhydrase
Name:Carbonic anhydrase
Type:PROTEIN
Mol. Mass.:29950.70
Organism:Drosophila melanogaster
Description:ChEMBL_942138
Residue:270
BDBM50382705
NameBDBM50382705
Synonyms:CHEMBL2023166
TypeSmall organic molecule
Emp. Form.C7H13N2OS2
Mol. Mass.205.321
SMILES[S-]C(=S)NCCN1CCOCC1