Reaction Details
TargetCarbonic anhydrase 12
LigandBDBM50426825
Substrate/Competitorn/a
Meas. Tech.ChEMBL_942141 (CHEMBL2341297)
Ki 7400±n/a nM
Citation Riafrecha, LERodríguez, OMVullo, DSupuran, CTColinas, PA Synthesis of C-cinnamoyl glycosides and their inhibitory activity against mammalian carbonic anhydrases. Bioorg Med Chem21:1489-94 (2013) 
 
Carbonic anhydrase 12
Name:Carbonic anhydrase 12
Type:Enzyme
Mol. Mass.:39456.00
Organism:Homo sapiens (Human)
Description:Catalytic domain of human cloned isozyme was used in the assay
Residue:354
BDBM50426825
NameBDBM50426825
Synonyms:CHEMBL2323138
TypeSmall organic molecule
Emp. Form.C16H20O7
Mol. Mass.324.3258
SMILESOC[C@H]1O[C@@H](CC(=O)C=Cc2cccc(O)c2)[C@H](O)[C@@H](O)[C@@H]1O