Reaction Details
TargetCarbonic anhydrase 9
LigandBDBM50426823
Substrate/Competitorn/a
Meas. Tech.ChEMBL_942142 (CHEMBL2341298)
Ki 8200±n/a nM
Citation Riafrecha, LERodríguez, OMVullo, DSupuran, CTColinas, PA Synthesis of C-cinnamoyl glycosides and their inhibitory activity against mammalian carbonic anhydrases. Bioorg Med Chem21:1489-94 (2013) 
 
Carbonic anhydrase 9
Name:Carbonic anhydrase 9
Type:Enzyme
Mol. Mass.:49669.03
Organism:Homo sapiens (Human)
Description:Catalytic domain of human cloned isozyme was used in the assay
Residue:459
BDBM50426823
NameBDBM50426823
Synonyms:CHEMBL2323140
TypeSmall organic molecule
Emp. Form.C16H20O7
Mol. Mass.324.3258
SMILESOC[C@H]1O[C@@H](CC(=O)C=Cc2ccc(O)cc2)[C@H](O)[C@@H](O)[C@H]1O