Reaction Details
TargetCarbonic anhydrase 3
LigandBDBM50426823
Substrate/Competitorn/a
Meas. Tech.ChEMBL_942149 (CHEMBL2341305)
Ki 8400±n/a nM
Citation Riafrecha, LERodríguez, OMVullo, DSupuran, CTColinas, PA Synthesis of C-cinnamoyl glycosides and their inhibitory activity against mammalian carbonic anhydrases. Bioorg Med Chem21:1489-94 (2013) 
 
Carbonic anhydrase 3
Name:Carbonic anhydrase 3
Type:Enzyme
Mol. Mass.:29562.11
Organism:Homo sapiens (Human)
Description:Human cloned isozyme.
Residue:260
BDBM50426823
NameBDBM50426823
Synonyms:CHEMBL2323140
TypeSmall organic molecule
Emp. Form.C16H20O7
Mol. Mass.324.3258
SMILESOC[C@H]1O[C@@H](CC(=O)C=Cc2ccc(O)cc2)[C@H](O)[C@@H](O)[C@H]1O