Reaction Details
TargetCarbonic anhydrase 1
LigandBDBM50426823
Substrate/Competitorn/a
Meas. Tech.ChEMBL_942150 (CHEMBL2341306)
Ki 5500±n/a nM
Citation Riafrecha, LERodríguez, OMVullo, DSupuran, CTColinas, PA Synthesis of C-cinnamoyl glycosides and their inhibitory activity against mammalian carbonic anhydrases. Bioorg Med Chem21:1489-94 (2013) 
 
Carbonic anhydrase 1
Name:Carbonic anhydrase 1
Type:Enzyme
Mol. Mass.:28873.37
Organism:Homo sapiens (Human)
Description:P00915
Residue:261
BDBM50426823
NameBDBM50426823
Synonyms:CHEMBL2323140
TypeSmall organic molecule
Emp. Form.C16H20O7
Mol. Mass.324.3258
SMILESOC[C@H]1O[C@@H](CC(=O)C=Cc2ccc(O)cc2)[C@H](O)[C@@H](O)[C@H]1O