Reaction Details
TargetCarbonic anhydrase 6
LigandBDBM50426824
Substrate/Competitorn/a
Meas. Tech.ChEMBL_942144 (CHEMBL2341300)
Ki 8100±n/a nM
Citation Riafrecha, LERodríguez, OMVullo, DSupuran, CTColinas, PA Synthesis of C-cinnamoyl glycosides and their inhibitory activity against mammalian carbonic anhydrases. Bioorg Med Chem21:1489-94 (2013) 
 
Carbonic anhydrase 6
Name:Carbonic anhydrase 6
Type:Enzyme
Mol. Mass.:35371.40
Organism:Homo sapiens (Human)
Description:P23280
Residue:308
BDBM50426824
NameBDBM50426824
Synonyms:CHEMBL2323139
TypeSmall organic molecule
Emp. Form.C16H20O7
Mol. Mass.324.3258
SMILESOC[C@H]1O[C@@H](CC(=O)C=Cc2cccc(O)c2)[C@H](O)[C@@H](O)[C@H]1O