Reaction Details
TargetCarbonic anhydrase 5B, mitochondrial
LigandBDBM50426824
Substrate/Competitorn/a
Meas. Tech.ChEMBL_942145 (CHEMBL2341301)
Ki>100000±n/a nM
Citation Riafrecha, LERodríguez, OMVullo, DSupuran, CTColinas, PA Synthesis of C-cinnamoyl glycosides and their inhibitory activity against mammalian carbonic anhydrases. Bioorg Med Chem21:1489-94 (2013) 
 
Carbonic anhydrase 5B, mitochondrial
Name:Carbonic anhydrase 5B, mitochondrial
Type:Enzyme
Mol. Mass.:36440.83
Organism:Homo sapiens (Human)
Description:Human (cloned) isozyme
Residue:317
BDBM50426824
NameBDBM50426824
Synonyms:CHEMBL2323139
TypeSmall organic molecule
Emp. Form.C16H20O7
Mol. Mass.324.3258
SMILESOC[C@H]1O[C@@H](CC(=O)C=Cc2cccc(O)c2)[C@H](O)[C@@H](O)[C@H]1O