Reaction Details
TargetCarbonic anhydrase 1
LigandBDBM26187
Substrate/Competitorn/a
Meas. Tech.ChEMBL_942150 (CHEMBL2341306)
Ki 10200±n/a nM
Citation Riafrecha, LERodríguez, OMVullo, DSupuran, CTColinas, PA Synthesis of C-cinnamoyl glycosides and their inhibitory activity against mammalian carbonic anhydrases. Bioorg Med Chem21:1489-94 (2013) 
 
Carbonic anhydrase 1
Name:Carbonic anhydrase 1
Type:Enzyme
Mol. Mass.:28873.37
Organism:Homo sapiens (Human)
Description:P00915
Residue:261
BDBM26187
NameBDBM26187
Synonyms:α-CA inhibitor, 11 US9688816, 2 | phenol
TypeSmall organic molecule
Emp. Form.C6H6O
Mol. Mass.94.1112
SMILESOc1ccccc1