Reaction Details
TargetCarbonic anhydrase 1
LigandBDBM50426826
Substrate/Competitorn/a
Meas. Tech.ChEMBL_942150 (CHEMBL2341306)
Ki 9300±n/a nM
Citation Riafrecha, LERodríguez, OMVullo, DSupuran, CTColinas, PA Synthesis of C-cinnamoyl glycosides and their inhibitory activity against mammalian carbonic anhydrases. Bioorg Med Chem21:1489-94 (2013) 
 
Carbonic anhydrase 1
Name:Carbonic anhydrase 1
Type:Enzyme
Mol. Mass.:28873.37
Organism:Homo sapiens (Human)
Description:P00915
Residue:261
BDBM50426826
NameBDBM50426826
Synonyms:CHEMBL2323137
TypeSmall organic molecule
Emp. Form.C24H28O11
Mol. Mass.492.4725
SMILESCC(=O)OC[C@H]1O[C@@H](CC(=O)C=Cc2ccc(O)cc2)[C@H](OC(C)=O)[C@@H](OC(C)=O)[C@H]1OC(C)=O