Reaction Details
TargetCarbonic anhydrase 5A, mitochondrial
LigandBDBM50426827
Substrate/Competitorn/a
Meas. Tech.ChEMBL_942146 (CHEMBL2341302)
Ki 9500±n/a nM
Citation Riafrecha, LERodríguez, OMVullo, DSupuran, CTColinas, PA Synthesis of C-cinnamoyl glycosides and their inhibitory activity against mammalian carbonic anhydrases. Bioorg Med Chem21:1489-94 (2013) 
 
Carbonic anhydrase 5A, mitochondrial
Name:Carbonic anhydrase 5A, mitochondrial
Type:Enzyme
Mol. Mass.:34755.54
Organism:Homo sapiens (Human)
Description:Human (cloned) isozyme
Residue:305
BDBM50426827
NameBDBM50426827
Synonyms:CHEMBL2323136
TypeSmall organic molecule
Emp. Form.C24H28O11
Mol. Mass.492.4725
SMILESCC(=O)OC[C@H]1O[C@@H](CC(=O)C=Cc2cccc(O)c2)[C@H](OC(C)=O)[C@@H](OC(C)=O)[C@H]1OC(C)=O