Reaction Details
TargetCarbonic anhydrase 3
LigandBDBM50426828
Substrate/Competitorn/a
Meas. Tech.ChEMBL_942149 (CHEMBL2341305)
Ki>100000±n/a nM
Citation Riafrecha, LERodríguez, OMVullo, DSupuran, CTColinas, PA Synthesis of C-cinnamoyl glycosides and their inhibitory activity against mammalian carbonic anhydrases. Bioorg Med Chem21:1489-94 (2013) 
 
Carbonic anhydrase 3
Name:Carbonic anhydrase 3
Type:Enzyme
Mol. Mass.:29562.11
Organism:Homo sapiens (Human)
Description:Human cloned isozyme.
Residue:260
BDBM50426828
NameBDBM50426828
Synonyms:CHEMBL2323135
TypeSmall organic molecule
Emp. Form.C24H28O11
Mol. Mass.492.4725
SMILESCC(=O)OC[C@H]1O[C@@H](CC(=O)C=Cc2ccc(O)cc2)[C@H](OC(C)=O)[C@@H](OC(C)=O)[C@@H]1OC(C)=O