Reaction Details
TargetCarbonic anhydrase 12
LigandBDBM50426829
Substrate/Competitorn/a
Meas. Tech.ChEMBL_942141 (CHEMBL2341297)
Ki 6700±n/a nM
Citation Riafrecha, LERodríguez, OMVullo, DSupuran, CTColinas, PA Synthesis of C-cinnamoyl glycosides and their inhibitory activity against mammalian carbonic anhydrases. Bioorg Med Chem21:1489-94 (2013) 
 
Carbonic anhydrase 12
Name:Carbonic anhydrase 12
Type:Enzyme
Mol. Mass.:39456.00
Organism:Homo sapiens (Human)
Description:Catalytic domain of human cloned isozyme was used in the assay
Residue:354
BDBM50426829
NameBDBM50426829
Synonyms:CHEMBL2323134
TypeSmall organic molecule
Emp. Form.C24H28O11
Mol. Mass.492.4725
SMILESCC(=O)OC[C@H]1O[C@@H](CC(=O)C=Cc2cccc(O)c2)[C@H](OC(C)=O)[C@@H](OC(C)=O)[C@@H]1OC(C)=O