Reaction Details
TargetCarbonic anhydrase 12
LigandBDBM50428449
Substrate/Competitorn/a
Meas. Tech.ChEMBL_942151 (CHEMBL2341307)
Ki 5940±n/a nM
Citation Tuccinardi, TBertini, SGranchi, COrtore, GMacchia, MMinutolo, FMartinelli, ASupuran, CT Salicylaldoxime derivatives as new leads for the development of carbonic anhydrase inhibitors. Bioorg Med Chem21:1511-5 (2013) 
 
Carbonic anhydrase 12
Name:Carbonic anhydrase 12
Type:Enzyme
Mol. Mass.:39456.00
Organism:Homo sapiens (Human)
Description:Catalytic domain of human cloned isozyme was used in the assay
Residue:354
BDBM50428449
NameBDBM50428449
Synonyms:CHEMBL449451
TypeSmall organic molecule
Emp. Form.C14H12FNO3
Mol. Mass.261.2484
SMILESCOc1ccc(cc1F)-c1ccc(O)c(CN=O)c1