Reaction Details
TargetCarbonic anhydrase 12
LigandBDBM50346463
Substrate/Competitorn/a
Meas. Tech.ChEMBL_942151 (CHEMBL2341307)
Ki 5530±n/a nM
Citation Tuccinardi, TBertini, SGranchi, COrtore, GMacchia, MMinutolo, FMartinelli, ASupuran, CT Salicylaldoxime derivatives as new leads for the development of carbonic anhydrase inhibitors. Bioorg Med Chem21:1511-5 (2013) 
 
Carbonic anhydrase 12
Name:Carbonic anhydrase 12
Type:Enzyme
Mol. Mass.:39456.00
Organism:Homo sapiens (Human)
Description:Catalytic domain of human cloned isozyme was used in the assay
Residue:354
BDBM50346463
NameBDBM50346463
Synonyms:(E)-2-chloro-3'-fluoro-4,4'-dihydroxybiphenyl-3-carbaldehyde oxime | CHEMBL1782958
TypeSmall organic molecule
Emp. Form.C13H9ClFNO3
Mol. Mass.281.667
SMILESOc1ccc(cc1F)-c1ccc(O)c(CN=O)c1Cl