Reaction Details
TargetCarbonic anhydrase 2
LigandBDBM50428445
Substrate/Competitorn/a
Meas. Tech.ChEMBL_942153 (CHEMBL2341786)
Ki 5870±n/a nM
Citation Tuccinardi, TBertini, SGranchi, COrtore, GMacchia, MMinutolo, FMartinelli, ASupuran, CT Salicylaldoxime derivatives as new leads for the development of carbonic anhydrase inhibitors. Bioorg Med Chem21:1511-5 (2013) 
 
Carbonic anhydrase 2
Name:Carbonic anhydrase 2
Type:Enzyme
Mol. Mass.:29250.71
Organism:Homo sapiens (Human)
Description:P00918
Residue:260
BDBM50428445
NameBDBM50428445
Synonyms:CHEMBL272457
TypeSmall organic molecule
Emp. Form.C14H10N2O3
Mol. Mass.254.2408
SMILESOc1ccc(cc1)-c1ccc(CN=O)c(O)c1C#N