Reaction Details
TargetCarbonic anhydrase 2
LigandBDBM50428450
Substrate/Competitorn/a
Meas. Tech.ChEMBL_942153 (CHEMBL2341786)
Ki 4130±n/a nM
Citation Tuccinardi, TBertini, SGranchi, COrtore, GMacchia, MMinutolo, FMartinelli, ASupuran, CT Salicylaldoxime derivatives as new leads for the development of carbonic anhydrase inhibitors. Bioorg Med Chem21:1511-5 (2013) 
 
Carbonic anhydrase 2
Name:Carbonic anhydrase 2
Type:Enzyme
Mol. Mass.:29250.71
Organism:Homo sapiens (Human)
Description:P00918
Residue:260
BDBM50428450
NameBDBM50428450
Synonyms:CHEMBL475278
TypeSmall organic molecule
Emp. Form.C13H10FNO3
Mol. Mass.247.2218
SMILESOc1ccc(cc1F)-c1ccc(O)c(CN=O)c1