Reaction Details
TargetCarbonic anhydrase 2
LigandBDBM50346462
Substrate/Competitorn/a
Meas. Tech.ChEMBL_942153 (CHEMBL2341786)
Ki 2300±n/a nM
Citation Tuccinardi, TBertini, SGranchi, COrtore, GMacchia, MMinutolo, FMartinelli, ASupuran, CT Salicylaldoxime derivatives as new leads for the development of carbonic anhydrase inhibitors. Bioorg Med Chem21:1511-5 (2013) 
 
Carbonic anhydrase 2
Name:Carbonic anhydrase 2
Type:Enzyme
Mol. Mass.:29250.71
Organism:Homo sapiens (Human)
Description:P00918
Residue:260
BDBM50346462
NameBDBM50346462
Synonyms:(E)-2-chloro-4,4'-dihydroxybiphenyl-3-carbaldehyde oxime | CHEMBL1782957
TypeSmall organic molecule
Emp. Form.C13H10ClNO3
Mol. Mass.263.676
SMILESOc1ccc(cc1)-c1ccc(O)c(CN=O)c1Cl