Reaction Details
TargetCarbonic anhydrase 1
LigandBDBM50428445
Substrate/Competitorn/a
Meas. Tech.ChEMBL_942154 (CHEMBL2341787)
Ki 7650±n/a nM
Citation Tuccinardi, TBertini, SGranchi, COrtore, GMacchia, MMinutolo, FMartinelli, ASupuran, CT Salicylaldoxime derivatives as new leads for the development of carbonic anhydrase inhibitors. Bioorg Med Chem21:1511-5 (2013) 
 
Carbonic anhydrase 1
Name:Carbonic anhydrase 1
Type:Enzyme
Mol. Mass.:28873.37
Organism:Homo sapiens (Human)
Description:P00915
Residue:261
BDBM50428445
NameBDBM50428445
Synonyms:CHEMBL272457
TypeSmall organic molecule
Emp. Form.C14H10N2O3
Mol. Mass.254.2408
SMILESOc1ccc(cc1)-c1ccc(CN=O)c(O)c1C#N