Reaction Details
TargetCarbonic anhydrase 1
LigandBDBM50428448
Substrate/Competitorn/a
Meas. Tech.ChEMBL_942154 (CHEMBL2341787)
Ki 7570±n/a nM
Citation Tuccinardi, TBertini, SGranchi, COrtore, GMacchia, MMinutolo, FMartinelli, ASupuran, CT Salicylaldoxime derivatives as new leads for the development of carbonic anhydrase inhibitors. Bioorg Med Chem21:1511-5 (2013) 
 
Carbonic anhydrase 1
Name:Carbonic anhydrase 1
Type:Enzyme
Mol. Mass.:28873.37
Organism:Homo sapiens (Human)
Description:P00915
Residue:261
BDBM50428448
NameBDBM50428448
Synonyms:CHEMBL479836
TypeSmall organic molecule
Emp. Form.C14H11ClFNO3
Mol. Mass.295.693
SMILESCC(N=O)c1ccc(-c2ccc(O)c(F)c2)c(Cl)c1O