Reaction Details
TargetCarbonic anhydrase 12
LigandBDBM50428490
Substrate/Competitorn/a
Meas. Tech.ChEMBL_943469 (CHEMBL2342409)
Ki 1.000000±n/a nM
Citation Jogaite, VZubriene, AMichailoviene, VGylyte, JMorkunaite, VMatulis, D Characterization of human carbonic anhydrase XII stability and inhibitor binding. Bioorg Med Chem21:1431-6 (2013) 
 
Carbonic anhydrase 12
Name:Carbonic anhydrase 12
Type:Enzyme
Mol. Mass.:39456.00
Organism:Homo sapiens (Human)
Description:Catalytic domain of human cloned isozyme was used in the assay
Residue:354
BDBM50428490
NameBDBM50428490
Synonyms:CHEMBL2335190
TypeSmall organic molecule
Emp. Form.C13H12O3
Mol. Mass.216.2326
SMILESCCc1ccc2ccc(=O)oc2c1C(C)=O