Reaction Details
Target5-hydroxytryptamine receptor 2B
LigandBDBM50428543
Substrate/Competitorn/a
Meas. Tech.ChEMBL_944013 (CHEMBL2340914)
Ki 15±n/a nM
Citation Fevig, JMFeng, JRossi, KAMiller, KJWu, GHung, CPUng, TMalmstrom, SEZhang, GKeim, WJCullen, MJRohrbach, KWQu, QGan, JPelleymounter, MARobl, JA Synthesis and SAR of 2,3,3a,4-tetrahydro-1H-pyrrolo[3,4-c]isoquinolin-5(9bH)-ones as 5-HT2C receptor agonists. Bioorg Med Chem Lett23:330-5 (2012) 
 
5-hydroxytryptamine receptor 2B
Name:5-hydroxytryptamine receptor 2B
Type:G Protein-Coupled Receptor (GPCR)
Mol. Mass.:54312.47
Organism:Homo sapiens (Human)
Description:Receptor binding assays were performed using human clone stably expressed in CHO cells.
Residue:481
BDBM50428543
NameBDBM50428543
Synonyms:CHEMBL2337103
TypeSmall organic molecule
Emp. Form.C14H18N2S
Mol. Mass.246.371
SMILESC1C[C@H]2[C@@H](CN1)c1cccc3SCCCN2c13