Reaction Details
Target5-hydroxytryptamine receptor 2A
LigandBDBM50428541
Substrate/Competitorn/a
Meas. Tech.ChEMBL_944533 (CHEMBL2339049)
Ki 13±n/a nM
Citation Fevig, JMFeng, JRossi, KAMiller, KJWu, GHung, CPUng, TMalmstrom, SEZhang, GKeim, WJCullen, MJRohrbach, KWQu, QGan, JPelleymounter, MARobl, JA Synthesis and SAR of 2,3,3a,4-tetrahydro-1H-pyrrolo[3,4-c]isoquinolin-5(9bH)-ones as 5-HT2C receptor agonists. Bioorg Med Chem Lett23:330-5 (2012) 
 
5-hydroxytryptamine receptor 2A
Name:5-hydroxytryptamine receptor 2A
Type:undefined
Mol. Mass.:52607.65
Organism:Homo sapiens (Human)
Description:P28223
Residue:471
BDBM50428541
NameBDBM50428541
Synonyms:CHEMBL2337501
TypeSmall organic molecule
Emp. Form.C12H13ClN2O
Mol. Mass.236.697
SMILESCc1ccc2[C@H]3CNC[C@@H]3NC(=O)c2c1Cl