Reaction Details
TargetAndrogen receptor
LigandBDBM50428550
Substrate/Competitorn/a
Meas. Tech.ChEMBL_944553 (CHEMBL2339069)
IC50 1100±n/a nM
Citation Yamamoto, SKobayashi, HKaku, TAikawa, KHara, TYamaoka, MKanzaki, NHasuoka, ABaba, AIto, M Design, synthesis, and biological evaluation of 3-aryl-3-hydroxy-1-phenylpyrrolidine derivatives as novel androgen receptor antagonists. Bioorg Med Chem21:70-83 (2012) 
 
Androgen receptor
Name:Androgen receptor
Type:Receptor
Mol. Mass.:99185.27
Organism:Homo sapiens (Human)
Description:CHO cells were stably transfected with human AR gene.
Residue:920
BDBM50428550
NameBDBM50428550
Synonyms:CHEMBL2337514
TypeSmall organic molecule
Emp. Form.C20H21ClN4O2
Mol. Mass.384.859
SMILESC[C@@H]1N(CC[C@@]1(O)c1ccc(nc1)C(=O)N(C)C)c1ccc(C#N)c(Cl)c1