Reaction Details
TargetAndrogen receptor
LigandBDBM50428555
Substrate/Competitorn/a
Meas. Tech.ChEMBL_944553 (CHEMBL2339069)
IC50 8.0±n/a nM
Citation Yamamoto, SKobayashi, HKaku, TAikawa, KHara, TYamaoka, MKanzaki, NHasuoka, ABaba, AIto, M Design, synthesis, and biological evaluation of 3-aryl-3-hydroxy-1-phenylpyrrolidine derivatives as novel androgen receptor antagonists. Bioorg Med Chem21:70-83 (2012) 
 
Androgen receptor
Name:Androgen receptor
Type:Receptor
Mol. Mass.:99185.27
Organism:Homo sapiens (Human)
Description:CHO cells were stably transfected with human AR gene.
Residue:920
BDBM50428555
NameBDBM50428555
Synonyms:CHEMBL2337509
TypeSmall organic molecule
Emp. Form.C18H16ClFN2O
Mol. Mass.330.784
SMILESC[C@@H]1N(CC[C@@]1(O)c1ccc(F)cc1)c1ccc(C#N)c(Cl)c1