Reaction Details
TargetAndrogen receptor
LigandBDBM50428559
Substrate/Competitorn/a
Meas. Tech.ChEMBL_944551 (CHEMBL2339067)
IC50 82±n/a nM
Citation Yamamoto, SKobayashi, HKaku, TAikawa, KHara, TYamaoka, MKanzaki, NHasuoka, ABaba, AIto, M Design, synthesis, and biological evaluation of 3-aryl-3-hydroxy-1-phenylpyrrolidine derivatives as novel androgen receptor antagonists. Bioorg Med Chem21:70-83 (2012) 
 
Androgen receptor
Name:Androgen receptor
Type:Receptor
Mol. Mass.:99185.27
Organism:Homo sapiens (Human)
Description:CHO cells were stably transfected with human AR gene.
Residue:920
BDBM50428559
NameBDBM50428559
Synonyms:CHEMBL2337506
TypeSmall organic molecule
Emp. Form.C11H11ClN2O
Mol. Mass.222.671
SMILESOC1CCN(C1)c1ccc(C#N)c(Cl)c1