Reaction Details
TargetAndrogen receptor
LigandBDBM50428551
Substrate/Competitorn/a
Meas. Tech.ChEMBL_944549 (CHEMBL2339065)
EC50>10000±n/a nM
Citation Yamamoto, SKobayashi, HKaku, TAikawa, KHara, TYamaoka, MKanzaki, NHasuoka, ABaba, AIto, M Design, synthesis, and biological evaluation of 3-aryl-3-hydroxy-1-phenylpyrrolidine derivatives as novel androgen receptor antagonists. Bioorg Med Chem21:70-83 (2012) 
 
Androgen receptor
Name:Androgen receptor
Type:Receptor
Mol. Mass.:99185.27
Organism:Homo sapiens (Human)
Description:CHO cells were stably transfected with human AR gene.
Residue:920
BDBM50428551
NameBDBM50428551
Synonyms:CHEMBL2337513
TypeSmall organic molecule
Emp. Form.C19H19ClN4O2
Mol. Mass.370.833
SMILESCNC(=O)c1ccc(cn1)[C@]1(O)CCN([C@H]1C)c1ccc(C#N)c(Cl)c1