Reaction Details
TargetCarbonic anhydrase 2
LigandBDBM50339449
Substrate/Competitorn/a
Meas. Tech.ChEMBL_944558 (CHEMBL2339074)
Ki 11±n/a nM
Citation Winum, JYColinas, PASupuran, CT Glycosidic carbonic anhydrase IX inhibitors: a sweet approach against cancer. Bioorg Med Chem21:1419-26 (2013) 
 
Carbonic anhydrase 2
Name:Carbonic anhydrase 2
Type:Enzyme
Mol. Mass.:29250.71
Organism:Homo sapiens (Human)
Description:P00918
Residue:260
BDBM50339449
NameBDBM50339449
Synonyms:1,2,3,4-Tetra-O-acetyl-6-sulfamoyl-beta-D-mannopyranose | CHEMBL1688310
TypeSmall organic molecule
Emp. Form.C14H21NO12S
Mol. Mass.427.381
SMILESCC(=O)O[C@@H]1O[C@H](COS(N)(=O)=O)[C@@H](OC(C)=O)[C@H](OC(C)=O)[C@@H]1OC(C)=O