Reaction Details
TargetCarbonic anhydrase 9
LigandBDBM50387132
Substrate/Competitorn/a
Meas. Tech.ChEMBL_946060 (CHEMBL2342097)
Ki 9±n/a nM
Citation Tarko, LSupuran, CT QSAR studies of sulfamate and sulfamide inhibitors targeting human carbonic anhydrase isozymes I, II, IX and XII. Bioorg Med Chem21:1404-9 (2013) 
 
Carbonic anhydrase 9
Name:Carbonic anhydrase 9
Type:Enzyme
Mol. Mass.:49669.03
Organism:Homo sapiens (Human)
Description:Catalytic domain of human cloned isozyme was used in the assay
Residue:459
BDBM50387132
NameBDBM50387132
Synonyms:4-ureidophenyl sulfamate ring derivative 3q | CHEMBL2047812
TypeSmall organic molecule
Emp. Form.C16H17N3O6S
Mol. Mass.379.388
SMILESCCOC(=O)c1ccc(NC(=O)Nc2ccc(OS(N)(=O)=O)cc2)cc1